Reaction Details
TargetPeroxisome proliferator-activated receptor delta
LigandBDBM50085041
Substrate/Competitorn/a
Meas. Tech.ChEMBL_1658509 (CHEMBL4008121)
EC50 20±n/a nM
Citation Piemontese, LCerchia, CLaghezza, AZiccardi, PSblano, STortorella, PIacobazzi, VInfantino, VConvertini, PDal Piaz, FLupo, AColantuoni, VLavecchia, ALoiodice, F New diphenylmethane derivatives as peroxisome proliferator-activated receptor alpha/gamma dual agonists endowed with anti-proliferative effects and mitochondrial activity. Eur J Med Chem127:379-397 (2017) 
 
Peroxisome proliferator-activated receptor delta
Name:Peroxisome proliferator-activated receptor delta
Type:Enzyme
Mol. Mass.:49910.45
Organism:Homo sapiens (Human)
Description:Q03181
Residue:441
BDBM50085041
NameBDBM50085041
Synonyms:2-(4-(3-(4-acetyl-3-hydroxy-2-propylphenoxy)propoxy)phenoxy)acetic acid L-165041 {4-[3-(4-Acetyl-3-hydroxy-2-propyl-phenoxy)-propoxy]-phenoxy}-acetic acid(L-165041) | {4-[3-(4-acetyl-3-hydroxy-2-propylphenoxy)propoxy]phenoxy}acetic acid
TypeSmall organic molecule
Emp. Form.C22H26O7
Mol. Mass.402.4376
SMILESCCCc1c(O)c(ccc1OCCCOc1ccc(OCC(O)=O)cc1)C(C)=O