Reaction Details
TargetPeroxisome proliferator-activated receptor gamma
LigandBDBM50030474
Substrate/Competitorn/a
Meas. Tech.ChEMBL_1658520 (CHEMBL4008132)
EC50 40±n/a nM
Citation Piemontese, LCerchia, CLaghezza, AZiccardi, PSblano, STortorella, PIacobazzi, VInfantino, VConvertini, PDal Piaz, FLupo, AColantuoni, VLavecchia, ALoiodice, F New diphenylmethane derivatives as peroxisome proliferator-activated receptor alpha/gamma dual agonists endowed with anti-proliferative effects and mitochondrial activity. Eur J Med Chem127:379-397 (2017) 
 
Peroxisome proliferator-activated receptor gamma
Name:Peroxisome proliferator-activated receptor gamma
Type:Nuclear Receptor
Mol. Mass.:57613.46
Organism:Homo sapiens (Human)
Description:P37231
Residue:505
BDBM50030474
NameBDBM50030474
Synonyms:Avandamet Avandia CHEBI:50122 US10744117, Compound Rosiglitazone | US9562012, rosiglitazone
TypeSmall organic molecule
Emp. Form.C18H19N3O3S
Mol. Mass.357.427
SMILESCN(CCOc1ccc(CC2SC(=O)NC2=O)cc1)c1ccccn1