Reaction Details
TargetHistone-lysine N-methyltransferase, H3 lysine-79 specific
LigandBDBM92645
Substrate/Competitorn/a
Meas. Tech.Enzyme Assay
Ki 20000±0.0 nM
Citation Basavapathruni, AJin, LDaigle, SRMajer, CRTherkelsen, CAWigle, TJKuntz, KWChesworth, RPollock, RMScott, MPMoyer, MPRichon, VMCopeland, RAOlhava, EJ Conformational Adaptation Drives Potent, Selective and Durable Inhibition of the Human Protein Methyltransferase DOT1L. Chem Biol Drug Des80:971-80 (2012) 
 
Histone-lysine N-methyltransferase, H3 lysine-79 specific
Name:Histone-lysine N-methyltransferase, H3 lysine-79 specific
Type:Protein
Mol. Mass.:184911.91
Organism:Homo sapiens (Human)
Description:Q8TEK3
Residue:1537
BDBM92645
NameBDBM92645
Synonyms:EPZ003144
TypeOrganic molecule
Emp. Form.C28H31N7O5
Mol. Mass.545.5896
SMILESCN(CCNC(=O)OCC1c2ccccc2-c2ccccc12)CC1OC([C@H](O)[C@@H]1O)n1cnc2c(N)ncnc12