Reaction Details
TargetSerine/threonine-protein kinase WNK1 [1-491]
LigandBDBM203826
Substrate/Competitorn/a
Meas. Tech.In vitro MBP Phosphorylation Assay (MBP)
pH7.3±n/a
Temperature298.15±n/a K
IC50 856±0.0 nM
Commentsextracted
Citation Yamada, KPark, HMRigel, DFDiPetrillo, KWhalen, EJAnisowicz, ABeil, MBerstler, JBrocklehurst, CEBurdick, DACaplan, SLCapparelli, MPChen, GChen, WDale, BDeng, LFu, FHamamatsu, NHarasaki, KHerr, THoffmann, PHu, QYHuang, WJIdamakanti, NImase, HIwaki, YJain, MJeyaseelan, JKato, MKaushik, VKKohls, DKunjathoor, VLaSala, DLee, JLiu, JLuo, YMa, FMo, RMowbray, SMogi, MOssola, FPandey, PPatel, SJRaghavan, SSalem, BShanado, YHTrakshel, GMTurner, GWakai, HWang, CWeldon, SWielicki, JBXie, XXu, LYagi, YIYasoshima, KYin, JYowe, DZhang, JHZheng, GMonovich, L Small-molecule WNK inhibition regulates cardiovascular and renal function. Nat Chem Biol12:896-898 (2016) 
 
Serine/threonine-protein kinase WNK1 [1-491]
Name:Serine/threonine-protein kinase WNK1 [1-491]
Type:n/a
Mol. Mass.:53757.75
Organism:Homo sapiens (Human)
Description:Q9H4A3 (1-491aa). Carna Biosciences, cat no. 05-179
Residue:491
BDBM203826
NameBDBM203826
Synonyms:(R)-1-(1-(2-(4-methoxyphenyl)acetyl)pyrrolidin-3-yl)-N-phenethyl-1H-imidazole-5-carboxamide (1) | WNK463 (1)
TypeSmall organic molecule
Emp. Form.C25H28N4O3
Mol. Mass.432.5148
SMILESCOc1ccc(CC(=O)N2CCC(C2)n2cncc2C(=O)NCCc2ccccc2)cc1