Reaction Details
TargetCoagulation factor XI
LigandBDBM289795
Substrate/Competitorn/a
Meas. Tech.Factor XIa Assay
pH7.4±n/a
Temperature298.15±n/a K
Ki 2.82±n/a nM
Commentsextracted
Citation Lim, YGuo, ZAli, AEdmondson, SDLiu, WGallo-Etienne, GVWu, HGao, YStamford, AWYu, YKevin, NJAnand, RSha, DNeelamkavil, SFHussain, ZKumar, PMoningka, RDuffy, JLXu, JJiang, YChakrabarti, ASone, H Factor XIa inhibitors US Patent US10093683 Publication Date 10/9/2018
 
Coagulation factor XI
Name:Coagulation factor XI
Type:Enzyme
Mol. Mass.:70130.58
Organism:Homo sapiens (Human)
Description:P03951
Residue:625
BDBM289795
NameBDBM289795
Synonyms:Methyl 2-amino-3-(5-fluoropyridin-2-yl)propanoate | US10093683, Example 74
TypeSmall organic molecule
Emp. Form.C29H26ClF2N5O6
Mol. Mass.613.996
SMILESCOC(=O)Nc1ccc(cc1)C(=O)NC(Cc1ccc(F)cn1)C(=O)N1CCC[C@@]2(C1)OC(=O)Nc1ccc(Cl)c(F)c21