Reaction Details
TargetCoagulation factor XI
LigandBDBM289797
Substrate/Competitorn/a
Meas. Tech.Factor XIa Assay
pH7.4±n/a
Temperature298.15±n/a K
Ki 33.3±n/a nM
Commentsextracted
Citation Lim, YGuo, ZAli, AEdmondson, SDLiu, WGallo-Etienne, GVWu, HGao, YStamford, AWYu, YKevin, NJAnand, RSha, DNeelamkavil, SFHussain, ZKumar, PMoningka, RDuffy, JLXu, JJiang, YChakrabarti, ASone, H Factor XIa inhibitors US Patent US10093683 Publication Date 10/9/2018
 
Coagulation factor XI
Name:Coagulation factor XI
Type:Enzyme
Mol. Mass.:70130.58
Organism:Homo sapiens (Human)
Description:P03951
Residue:625
BDBM289797
NameBDBM289797
Synonyms:Methyl (4-(((S)-1-((R)-6-chloro-2-oxo-1,2-dihydrospiro[benzo[d][1,3]oxazine-4,3′-piperidin]-1′-yl)-4-(3,3-difluoroazetidin-1-yl)-1,4-dioxobutan-2-yl)carbamoyl)phenyl)carbamate | US10093683, Example 85
TypeSmall organic molecule
Emp. Form.C28H28ClF2N5O7
Mol. Mass.620.001
SMILESCOC(=O)Nc1ccc(cc1)C(=O)N[C@@H](CC(=O)N1CC(F)(F)C1)C(=O)N1CCC[C@@]2(C1)OC(=O)Nc1ccc(Cl)cc21