Reaction Details
TargetCoagulation factor XI
LigandBDBM289807
Substrate/Competitorn/a
Meas. Tech.Factor XIa Assay
pH7.4±n/a
Temperature298.15±n/a K
Ki 246±n/a nM
Commentsextracted
Citation Lim, YGuo, ZAli, AEdmondson, SDLiu, WGallo-Etienne, GVWu, HGao, YStamford, AWYu, YKevin, NJAnand, RSha, DNeelamkavil, SFHussain, ZKumar, PMoningka, RDuffy, JLXu, JJiang, YChakrabarti, ASone, H Factor XIa inhibitors US Patent US10093683 Publication Date 10/9/2018
 
Coagulation factor XI
Name:Coagulation factor XI
Type:Enzyme
Mol. Mass.:70130.58
Organism:Homo sapiens (Human)
Description:P03951
Residue:625
BDBM289807
NameBDBM289807
Synonyms:US10093683, Example 118A US10093683, Example 118C | US10093683, Example 118D
TypeSmall organic molecule
Emp. Form.C27H30ClFN4O7
Mol. Mass.577.001
SMILESCO[C@@H](C)C[C@H](NC(=O)c1ccc(NC(=O)OC)cc1)C(=O)N1CCC[C@@]2(C1)OC(=O)Nc1ccc(Cl)c(F)c21