Reaction Details
TargetNuclear receptor ROR-gamma [258-518,Y502F]
LigandBDBM221232
Substrate/Competitorn/a
Meas. Tech.RORγt Reporter Assay
IC50 81±n/a nM
Citation Leonard, KABarbay, KEdwards, JPKreutter, KDKummer, DAMaharoof, UNishimura, RUrbanski, MVenkatesan, HWang, AWolin, RLWoods, CRFourie, AXue, X Heteroaryl linked quinolinyl modulators of RORγt US Patent US9303015 Publication Date 4/5/2016
 
Nuclear receptor ROR-gamma [258-518,Y502F]
Name:Nuclear receptor ROR-gamma [258-518,Y502F]
Type:Enzyme
Mol. Mass.:30130.98
Organism:Homo sapiens (Human)
Description:Artificial LBD sequence mutated AF2 domain (Seq No: 9)
Residue:261
BDBM221232
NameBDBM221232
Synonyms:US9303015, 6a US9303015, 6c
TypeSmall organic molecule
Emp. Form.C30H27ClF3N5O2
Mol. Mass.582.016
SMILESCCN(CC)c1nc2ccc(cc2c(Cl)c1Oc1ccccc1)C(O)(c1cncn1C)c1ccc(nc1)C(F)(F)F