Reaction Details
TargetNuclear receptor ROR-gamma [258-518,Y502F]
LigandBDBM221251
Substrate/Competitorn/a
Meas. Tech.RORγt Reporter Assay
IC50 250±n/a nM
Citation Leonard, KABarbay, KEdwards, JPKreutter, KDKummer, DAMaharoof, UNishimura, RUrbanski, MVenkatesan, HWang, AWolin, RLWoods, CRFourie, AXue, X Heteroaryl linked quinolinyl modulators of RORγt US Patent US9303015 Publication Date 4/5/2016
 
Nuclear receptor ROR-gamma [258-518,Y502F]
Name:Nuclear receptor ROR-gamma [258-518,Y502F]
Type:Enzyme
Mol. Mass.:30130.98
Organism:Homo sapiens (Human)
Description:Artificial LBD sequence mutated AF2 domain (Seq No: 9)
Residue:261
BDBM221251
NameBDBM221251
Synonyms:US9303015, 25a US9303015, 25c
TypeSmall organic molecule
Emp. Form.C29H21ClF6N4O3
Mol. Mass.622.945
SMILESCCOc1nc2ccc(cc2c(c1Oc1ccc(Cl)cc1)C(F)(F)F)C(O)(c1cncn1C)c1ccc(nc1)C(F)(F)F