Reaction Details
TargetNuclear receptor ROR-gamma [258-518,Y502F]
LigandBDBM221255
Substrate/Competitorn/a
Meas. Tech.RORγt Reporter Assay
IC50 470±n/a nM
Citation Leonard, KABarbay, KEdwards, JPKreutter, KDKummer, DAMaharoof, UNishimura, RUrbanski, MVenkatesan, HWang, AWolin, RLWoods, CRFourie, AXue, X Heteroaryl linked quinolinyl modulators of RORγt US Patent US9303015 Publication Date 4/5/2016
 
Nuclear receptor ROR-gamma [258-518,Y502F]
Name:Nuclear receptor ROR-gamma [258-518,Y502F]
Type:Enzyme
Mol. Mass.:30130.98
Organism:Homo sapiens (Human)
Description:Artificial LBD sequence mutated AF2 domain (Seq No: 9)
Residue:261
BDBM221255
NameBDBM221255
Synonyms:US9303015, 29
TypeSmall organic molecule
Emp. Form.C31H28ClF3N4O2
Mol. Mass.581.028
SMILESCCN(CC)c1nc2ccc(cc2c(c1Oc1ccccc1)C(F)(F)F)C(O)(c1cncn1C)c1ccc(Cl)cc1