Reaction Details
TargetTyrosine-protein kinase JAK2
LigandBDBM325375
Substrate/Competitorn/a
Meas. Tech.JAK2 Inhibition Assay
IC50<10±n/a nM
Citation Allen, SBoys, MLChicarelli, MJFell, JBFischer, JPGaudino, JHicken, EJHinklin, RJKraser, CFLaird, ERobinson, JETang, TPBurgess, LERieger, RAPheneger, JSatoh, YLeftheris, KRaheja, RKBennett, BL 4,6-substituted-pyrazolo[1,5-a]pyrazines as janus kinase inhibitors US Patent US10189845 Publication Date 1/29/2019
 
Tyrosine-protein kinase JAK2
Name:Tyrosine-protein kinase JAK2
Type:Protein
Mol. Mass.:130684.68
Organism:Homo sapiens (Human)
Description:O60674
Residue:1132
BDBM325375
NameBDBM325375
Synonyms:6-(1-(1-(methylsulfonyl)azetidin-3-yl)-1H-pyrazol-4-yl)-4-(1-(pentan-3-yl)-1H-pyrazol-4-yl)pyrazolo[1,5-a]pyrazine US11028093, Example 37
TypeSmall organic molecule
Emp. Form.C21H26N8O2S
Mol. Mass.454.549
SMILESCCC(CC)n1cc(cn1)-c1nc(cn2nccc12)-c1cnn(c1)C1CN(C1)S(C)(=O)=O