Reaction Details
TargetTyrosine-protein kinase JAK2
LigandBDBM325452
Substrate/Competitorn/a
Meas. Tech.JAK2 Inhibition Assay
IC50 55±n/a nM
Citation Allen, SBoys, MLChicarelli, MJFell, JBFischer, JPGaudino, JHicken, EJHinklin, RJKraser, CFLaird, ERobinson, JETang, TPBurgess, LERieger, RAPheneger, JSatoh, YLeftheris, KRaheja, RKBennett, BL 4,6-substituted-pyrazolo[1,5-a]pyrazines as janus kinase inhibitors US Patent US10189845 Publication Date 1/29/2019
 
Tyrosine-protein kinase JAK2
Name:Tyrosine-protein kinase JAK2
Type:Protein
Mol. Mass.:130684.68
Organism:Homo sapiens (Human)
Description:O60674
Residue:1132
BDBM325452
NameBDBM325452
Synonyms:(S)-1-(4-(4-(1-(pentan-3- yl)-1H-pyrazol-4- yl)pyrazolo[1,5- a]pyrazin-6-yl)-1H- pyrazol-1-yl)butan-2-ol US10730880, Example 114 | US11028093, Example 114
TypeSmall organic molecule
Emp. Form.C21H27N7O
Mol. Mass.393.4854
SMILESCC[C@H](O)Cn1cc(cn1)-c1cn2nccc2c(n1)-c1cnn(c1)C(CC)CC