Reaction Details
TargetTyrosine-protein kinase JAK2
LigandBDBM325489
Substrate/Competitorn/a
Meas. Tech.JAK2 Inhibition Assay
IC50 55±n/a nM
Citation Allen, SBoys, MLChicarelli, MJFell, JBFischer, JPGaudino, JHicken, EJHinklin, RJKraser, CFLaird, ERobinson, JETang, TPBurgess, LERieger, RAPheneger, JSatoh, YLeftheris, KRaheja, RKBennett, BL 4,6-substituted-pyrazolo[1,5-a]pyrazines as janus kinase inhibitors US Patent US10189845 Publication Date 1/29/2019
 
Tyrosine-protein kinase JAK2
Name:Tyrosine-protein kinase JAK2
Type:Protein
Mol. Mass.:130684.68
Organism:Homo sapiens (Human)
Description:O60674
Residue:1132
BDBM325489
NameBDBM325489
Synonyms:US10189845, Example 151B US11028093, Example 151
TypeSmall organic molecule
Emp. Form.C22H27N7O2
Mol. Mass.421.4955
SMILESC[C@@H]1CCCC[C@H]1n1cc(cn1)-c1nc(cn2nccc12)-c1cnn(C[C@@H](O)CO)c1