Reaction Details
TargetProthrombin
LigandBDBM21744
Substrate/CompetitorBDBM21752
Meas. Tech.Enzyme Inhibition Assay
pH8.5±n/a
Temperature295.15±n/a K
Ki 40400±n/a nM
Citation Li, PJiang, SLee, SLLin, CYJohnson, MDDickson, RBMichejda, CJRoller, PP Design and synthesis of novel and potent inhibitors of the type II transmembrane serine protease, matriptase, based upon the sunflower trypsin inhibitor-1. J Med Chem50:5976-83 (2007) 
 
Prothrombin
Name:Prothrombin
Type:Enzyme
Mol. Mass.:70502.73
Organism:Bos taurus (Bovine)
Description:P00735
Residue:625
BDBM21744
BDBM21752
NameBDBM21744
Synonyms:2-[(1S,7S,10S,13S,16S,22S,25S,31S,34S,37S,40S,43S,46S)-40-(4-aminobutyl)-16-benzyl-10,46-bis[(2S)-butan-2-yl]-31-(3-carbamimidamidopropyl)-37-[(1R)-1-hydroxyethyl]-13,34,43-tris(hydroxymethyl)-2,8,11,14,17,23,26,29,32,35,38,41,44,47-tetradecaoxo-3,9,12,15,18,24,27,30,33,36,39,42,45,48-tetradecaazatetracyclo[46.3.0.0^{3,7}.0^{18,22}]henpentacontan-25-yl]acetic acid | Sunflower trypsin inhibitor-1(SFTI-1) analogue, 7
Typemonocyclic peptide
Emp. Form.C67H106N18O20
Mol. Mass.1483.6671
SMILES[#6]-[#6]-[#6@H](-[#6])-[#6@@H]-1-[#7]-[#6](=O)-[#6@@H]-2-[#6]-[#6]-[#6]-[#7]-2-[#6](=O)-[#6@@H]-2-[#6]-[#6]-[#6]-[#7]-2-[#6](=O)-[#6@@H](-[#7]-[#6](=O)-[#6@H](-[#6]-[#8])-[#7]-[#6](=O)-[#6@H](-[#6]-[#6]-[#6]-[#6]-[#7])-[#7]-[#6](=O)-[#6@@H](-[#7]-[#6](=O)-[#6@H](-[#6]-[#8])-[#7]-[#6](=O)-[#6@H](-[#6]-[#6]-[#6]\[#7]=[#6](\[#7])-[#7])-[#7]-[#6](=O)-[#6]-[#7]-[#6](=O)-[#6@H](-[#6]-[#6](-[#8])=O)-[#7]-[#6](=O)-[#6@@H]-2-[#6]-[#6]-[#6]-[#7]-2-[#6](=O)-[#6@H](-[#6]-c2ccccc2)-[#7]-[#6](=O)-[#6@H](-[#6]-[#8])-[#7]-[#6]-1=O)-[#6@@H](-[#6])-[#8])-[#6@@H](-[#6])-[#6]-[#6]