Reaction Details
TargetNociceptin receptor
LigandBDBM29988
Substrate/CompetitorBDBM29961
Meas. Tech.Radioligand Binding Assay
pH7.4±n/a
Temperature310.15±n/a K
IC50 0.81±n/a nM
Citation Kobayashi, KUchiyama, MTakahashi, HKawamoto, HIto, SYoshizumi, TNakashima, HKato, TShimizu, AYamamoto, IAsai, MMiyazoe, HOhno, AHirayama, MOzaki, STani, TIshii, YTanaka, TMochidome, TTadano, KFukuroda, TOhta, HOkamoto, O 2-Cyclohexylcarbonylbenzimidazoles as potent, orally available and brain-penetrable opioid receptor-like 1 (ORL1) antagonists. Bioorg Med Chem Lett19:3096-9 (2009) 
 
Nociceptin receptor
Name:Nociceptin receptor
Type:G Protein-Coupled Receptor (GPCR)
Mol. Mass.:40702.87
Organism:Homo sapiens (Human)
Description:P41146
Residue:370
BDBM29988
BDBM29961
NameBDBM29988
Synonyms:benzimidazole analogue, 7h | benzimidazole derivative, 2
TypeSmall organic molecule
Emp. Form.C23H34ClN5OS
Mol. Mass.464.067
SMILESCCN1CCN(CC1)c1cc2[nH]c(S[C@@]3(C)CC[C@@H](CC3)N(C)C(C)=O)nc2cc1Cl