Reaction Details
TargetAurora kinase A
LigandBDBM36469
Substrate/Competitorn/a
Meas. Tech.Aurora A Inhibition Assay
pH9.5±0
Temperature289.15±0 K
IC50 2.1e+3±n/a nM
Citation Clark, MAAcharya, RAArico-Muendel, CCBelyanskaya, SLBenjamin, DRCarlson, NRCentrella, PAChiu, CHCreaser, SPCuozzo, JWDavie, CPDing, YFranklin, GJFranzen, KDGefter, MLHale, SPHansen, NJIsrael, DIJiang, JKavarana, MJKelley, MSKollmann, CSLi, FLind, KMataruse, SMedeiros, PFMesser, JAMyers, PO'Keefe, HOliff, MCRise, CESatz, ALSkinner, SRSvendsen, JLTang, Lvan Vloten, KWagner, RWYao, GZhao, BMorgan, BA Design, synthesis and selection of DNA-encoded small-molecule libraries. Nat Chem Biol5:647-54 (2009) 
 
Aurora kinase A
Name:Aurora kinase A
Type:Serine/threonine-protein kinase
Mol. Mass.:45830.98
Organism:Homo sapiens (Human)
Description:O14965
Residue:403
BDBM36469
NameBDBM36469
Synonyms:DEL-A, 10 | N2-(3,4-Dimethoxyphenyl)-N4-(2-fluorophenethyl)-N6-(quinolin-6-yl)-1,3,5-triazine-2,4,6-triamine
TypeSmall organic molecule
Emp. Form.C28H26FN7O
Mol. Mass.495.5507
SMILESCOc1cc(Nc2nc(NCCc3ccccc3F)nc(Nc3ccc4ncccc4c3)n2)ccc1C