Reaction Details
TargetStearoyl-CoA desaturase
LigandBDBM50267923
Substrate/Competitorn/a
Meas. Tech.ChEMBL_1704128 (CHEMBL4055361)
IC50 21±n/a nM
Citation Imamura, KTomita, NKawakita, YIto, YOno, KNii, NMiyazaki, TYonemori, KTawada, MSumi, HSatoh, YYamamoto, YMiyahisa, ISasaki, MSatomi, YHirayama, MNishigaki, RMaezaki, H Discovery of Novel and Potent Stearoyl Coenzyme A Desaturase 1 (SCD1) Inhibitors as Anticancer Agents. Bioorg Med Chem25:3768-3779 (2017) 
 
Stearoyl-CoA desaturase
Name:Stearoyl-CoA desaturase
Type:Enzyme
Mol. Mass.:41537.27
Organism:Homo sapiens (Human)
Description:O00767
Residue:359
BDBM50267923
NameBDBM50267923
Synonyms:CHEMBL4071569
TypeSmall organic molecule
Emp. Form.C23H26N6O2
Mol. Mass.418.4915
SMILESCC(C)(C)c1ccc(cc1)C1(CCN(CC1)c1ccc(nn1)-c1nc(CO)no1)C#N