Reaction Details
TargetStearoyl-CoA desaturase
LigandBDBM50267936
Substrate/Competitorn/a
Meas. Tech.ChEMBL_1704128 (CHEMBL4055361)
IC50 15±n/a nM
Citation Imamura, KTomita, NKawakita, YIto, YOno, KNii, NMiyazaki, TYonemori, KTawada, MSumi, HSatoh, YYamamoto, YMiyahisa, ISasaki, MSatomi, YHirayama, MNishigaki, RMaezaki, H Discovery of Novel and Potent Stearoyl Coenzyme A Desaturase 1 (SCD1) Inhibitors as Anticancer Agents. Bioorg Med Chem25:3768-3779 (2017) 
 
Stearoyl-CoA desaturase
Name:Stearoyl-CoA desaturase
Type:Enzyme
Mol. Mass.:41537.27
Organism:Homo sapiens (Human)
Description:O00767
Residue:359
BDBM50267936
NameBDBM50267936
Synonyms:CHEMBL4074320
TypeSmall organic molecule
Emp. Form.C19H17ClN6O2
Mol. Mass.396.83
SMILESOCc1noc(n1)-c1ccc(nn1)N1CCC(CC1)(C#N)c1cccc(Cl)c1