Reaction Details
TargetStearoyl-CoA desaturase
LigandBDBM50267944
Substrate/Competitorn/a
Meas. Tech.ChEMBL_1704128 (CHEMBL4055361)
IC50 38±n/a nM
Citation Imamura, KTomita, NKawakita, YIto, YOno, KNii, NMiyazaki, TYonemori, KTawada, MSumi, HSatoh, YYamamoto, YMiyahisa, ISasaki, MSatomi, YHirayama, MNishigaki, RMaezaki, H Discovery of Novel and Potent Stearoyl Coenzyme A Desaturase 1 (SCD1) Inhibitors as Anticancer Agents. Bioorg Med Chem25:3768-3779 (2017) 
 
Stearoyl-CoA desaturase
Name:Stearoyl-CoA desaturase
Type:Enzyme
Mol. Mass.:41537.27
Organism:Homo sapiens (Human)
Description:O00767
Residue:359
BDBM50267944
NameBDBM50267944
Synonyms:CHEMBL4084609
TypeSmall organic molecule
Emp. Form.C19H18F3N5O2
Mol. Mass.405.3737
SMILESOCc1noc(n1)-c1ccc(nn1)N1CCC(CC1)(c1ccccc1)C(F)(F)F