Reaction Details
TargetStearoyl-CoA desaturase
LigandBDBM50267946
Substrate/Competitorn/a
Meas. Tech.ChEMBL_1704139 (CHEMBL4055372)
IC50 6.5±n/a nM
Citation Imamura, KTomita, NKawakita, YIto, YOno, KNii, NMiyazaki, TYonemori, KTawada, MSumi, HSatoh, YYamamoto, YMiyahisa, ISasaki, MSatomi, YHirayama, MNishigaki, RMaezaki, H Discovery of Novel and Potent Stearoyl Coenzyme A Desaturase 1 (SCD1) Inhibitors as Anticancer Agents. Bioorg Med Chem25:3768-3779 (2017) 
 
Stearoyl-CoA desaturase
Name:Stearoyl-CoA desaturase
Type:Enzyme
Mol. Mass.:41537.27
Organism:Homo sapiens (Human)
Description:O00767
Residue:359
BDBM50267946
NameBDBM50267946
Synonyms:CHEMBL4075104
TypeSmall organic molecule
Emp. Form.C18H17N5O3
Mol. Mass.351.3593
SMILESOCc1noc(n1)-c1ccc(nn1)N1CCC2(COc3ccccc23)C1