Reaction Details
TargetHistamine H3 receptor
LigandBDBM50272087
Substrate/Competitorn/a
Meas. Tech.ChEMBL_1712144 (CHEMBL4122193)
Ki 21±n/a nM
Citation ?a?ewska, DKaleta, MHagenow, SMogilski, SLatacz, GKarcz, TLubelska, AHonkisz, EHandzlik, JReiner, DSata?a, GFilipek, BStark, HKie?-Kononowicz, K Novel naphthyloxy derivatives - Potent histamine H Bioorg Med Chem26:2573-2585 (2018) 
 
Histamine H3 receptor
Name:Histamine H3 receptor
Type:G Protein-Coupled Receptor (GPCR)
Mol. Mass.:48691.47
Organism:Homo sapiens (Human)
Description:Binding assays were using CHO cells stably expressing hH3R receptors.
Residue:445
BDBM50272087
NameBDBM50272087
Synonyms:CHEMBL4125793
TypeSmall organic molecule
Emp. Form.C25H35N3O3
Mol. Mass.425.5637
SMILESC[C@H](NCc1ccc(OCc2ccc(OCCCN3CCCCC3)cc2)cc1)C(N)=O