Reaction Details
TargetAcetylcholinesterase
LigandBDBM50424045
Substrate/Competitorn/a
Meas. Tech.ChEMBL_1982757 (CHEMBL4616019)
Ki 93.4±n/a nM
Citation Catto, MPisani, Lde la Mora, EBelviso, BDMangiatordi, GFPinto, APalma, ADenora, NCaliandro, RColletier, JPSilman, INicolotti, OAltomare, CD Chiral Separation, X-ray Structure, and Biological Evaluation of a Potent and Reversible Dual Binding Site AChE Inhibitor. ACS Med Chem Lett11:869-876 (2020) 
 
Acetylcholinesterase
Name:Acetylcholinesterase
Type:Enzyme
Mol. Mass.:67792.70
Organism:Homo sapiens (Human)
Description:P22303
Residue:614
BDBM50424045
NameBDBM50424045
Synonyms:CHEMBL2314726
TypeSmall organic molecule
Emp. Form.C25H28N2O5
Mol. Mass.436.5002
SMILESCOc1cc2cc(NC(=O)[C@H]3CCC[C@H](C3)NCc3ccccc3)c(=O)oc2cc1OC