Reaction Details
TargetTyrosine-protein kinase BTK
LigandBDBM50357312
Substrate/Competitorn/a
Meas. Tech.ChEMBL_1983364 (CHEMBL4616770)
Ki 425±n/a nM
Citation Watterson, SHLiu, QBeaudoin Bertrand, MBatt, DGLi, LPattoli, MASkala, SCheng, LObermeier, MTMoore, RYang, ZVickery, RElzinga, PADiscenza, LD'Arienzo, CGillooly, KMTaylor, TLPulicicchio, CZhang, YHeimrich, EMcIntyre, KWRuan, QWesthouse, RACatlett, IMZheng, NChaudhry, CDai, JGalella, MATebben, AJPokross, MLi, JZhao, RSmith, DRampulla, RAllentoff, AWallace, MAMathur, ASalter-Cid, LMacor, JECarter, PHFura, ABurke, JRTino, JA Discovery of Branebrutinib (BMS-986195): A Strategy for Identifying a Highly Potent and Selective Covalent Inhibitor Providing Rapid in Vivo Inactivation of Bruton's Tyrosine Kinase (BTK). J Med Chem62:3228-3250 (2019) 
 
Tyrosine-protein kinase BTK
Name:Tyrosine-protein kinase BTK
Type:Enzyme
Mol. Mass.:76289.95
Organism:Homo sapiens (Human)
Description:Q06187
Residue:659
BDBM50357312
NameBDBM50357312
Synonyms:IBRUTINIB US10124003, Ref. Ex. Compound 1 US10793575, Example ibrutinib US10919899, Ibrutinib US11186578, Example Ibrutinib US11407754, Example Ibrutinib US20240059694, Compound Ibrutinib US9181263, 1 | US9278100, 1
TypeSmall organic molecule
Emp. Form.C25H24N6O2
Mol. Mass.440.4971
SMILESNc1ncnc2n(nc(-c3ccc(Oc4ccccc4)cc3)c12)[C@@H]1CCCN(C1)C(=O)C=C