Reaction Details
TargetPotassium voltage-gated channel subfamily KQT member 1
LigandBDBM50106176
Substrate/Competitorn/a
Meas. Tech.ChEMBL_158397 (CHEMBL767061)
IC50 40±n/a nM
Citation Lloyd, JSchmidt, JBRovnyak, GAhmad, SAtwal, KSBisaha, SNDoweyko, LMStein, PDTraeger, SCMathur, AConder, MLDiMarco, JHarper, TWJenkins-West, TLevesque, PCNormandin, DERussell, ADSerafino, RPSmith, MALodge, NJ Design and synthesis of 4-substituted benzamides as potent, selective, and orally bioavailable I(Ks) blockers. J Med Chem44:3764-7 (2001) Potassium voltage-gated channel subfamily KQT member 1
Name:Potassium voltage-gated channel subfamily KQT member 1
Type:PROTEIN
Mol. Mass.:74450.11
Organism:Cavia porcellus
Description:ChEMBL_88894
Residue:671
BDBM50106176
NameBDBM50106176
Synonyms:CHEMBL340681 | Enantiomer-N-(2,2-Dimethyl-cyclopentylmethyl)-4-[5-(3,3,3-trifluoro-propyl)-[1,2,4]oxadiazol-3-yl]-benzamide
TypeSmall organic molecule
Emp. Form.C20H24F3N3O2
Mol. Mass.395.4187
SMILESCC1(C)CCCC1CNC(=O)c1ccc(cc1)-c1noc(CCC(F)(F)F)n1