Reaction Details
TargetPotassium voltage-gated channel subfamily KQT member 1
LigandBDBM50106181
Substrate/Competitorn/a
Meas. Tech.ChEMBL_158397 (CHEMBL767061)
IC50 540±n/a nM
Citation Lloyd, JSchmidt, JBRovnyak, GAhmad, SAtwal, KSBisaha, SNDoweyko, LMStein, PDTraeger, SCMathur, AConder, MLDiMarco, JHarper, TWJenkins-West, TLevesque, PCNormandin, DERussell, ADSerafino, RPSmith, MALodge, NJ Design and synthesis of 4-substituted benzamides as potent, selective, and orally bioavailable I(Ks) blockers. J Med Chem44:3764-7 (2001) Potassium voltage-gated channel subfamily KQT member 1
Name:Potassium voltage-gated channel subfamily KQT member 1
Type:PROTEIN
Mol. Mass.:74450.11
Organism:Cavia porcellus
Description:ChEMBL_88894
Residue:671
BDBM50106181
NameBDBM50106181
Synonyms:Biphenyl-4-carboxylic acid (3,3-dimethyl-butyl)-amide | CHEMBL125016
TypeSmall organic molecule
Emp. Form.C19H23NO
Mol. Mass.281.392
SMILESCC(C)(C)CCNC(=O)c1ccc(cc1)-c1ccccc1