Reaction Details
TargetKetohexokinase
LigandBDBM319585
Substrate/Competitorn/a
Meas. Tech.ChEMBL_2022267 (CHEMBL4676080)
Ki 4.5±n/a nM
Citation Futatsugi, KSmith, ACTu, MRaymer, BAhn, KCoffey, SBDowling, MSFernando, DPGutierrez, JAHuard, KJasti, JKalgutkar, ASKnafels, JDPandit, JParris, KDPerez, SPfefferkorn, JAPrice, DARyder, TShavnya, AStock, IATsai, ASTesz, GJThuma, BAWeng, YWisniewska, HMXing, GZhou, JMagee, TV Discovery of PF-06835919: A Potent Inhibitor of Ketohexokinase (KHK) for the Treatment of Metabolic Disorders Driven by the Overconsumption of Fructose. J Med Chem63:13546-13560 (2020) 
 
Ketohexokinase
Name:Ketohexokinase
Type:Enzyme Catalytic Domain
Mol. Mass.:32521.64
Organism:Homo sapiens (Human)
Description:n/a
Residue:298
BDBM319585
NameBDBM319585
Synonyms:US10174007, Example 4 US10988463, Example 4 | US11634410, Example 4
TypeSmall organic molecule
Emp. Form.C16H19F3N4O2
Mol. Mass.356.3429
SMILESC[C@H]1CCN1c1nc(cc(n1)C(F)(F)F)N1C[C@H]2[C@H](CC(O)=O)[C@H]2C1