Reaction Details
TargetC-C chemokine receptor type 5
LigandBDBM50110088
Substrate/Competitorn/a
Meas. Tech.ChEBML_39510
IC50 0.130000±n/a nM
Citation Lynch, CLGentry, ALHale, JJMills, SGMacCoss, MMalkowitz, LSpringer, MSGould, SLDeMartino, JASiciliano, SJCascieri, MADoss, GCarella, ACarver, GHolmes, KSchleif, WADanzeisen, RHazuda, DKessler, JLineberger, JMiller, MEmini, EA CCR5 antagonists: bicyclic isoxazolidines as conformationally constrained N-1-substituted pyrrolidines. Bioorg Med Chem Lett12:677-9 (2002) C-C chemokine receptor type 5
Name:C-C chemokine receptor type 5
Type:Enzyme
Mol. Mass.:40540.21
Organism:Homo sapiens (Human)
Description:P51681
Residue:352
BDBM50110088
NameBDBM50110088
Synonyms:4N-allyl-4N-[4-nitrobenzyloxycarboyl]-1-[4'-phenyl-(3a'S,4'S,5'S)-spiro[cyclohexane-1,2'-perhydropyrrolo[1,2-b]isoxazole]-5-ylmethyl]hexahydro-4-pyridinamine | CHEMBL157491
TypeSmall organic molecule
Emp. Form.C34H44N4O5
Mol. Mass.588.737
SMILES[O-][N+](=O)c1ccc(COC(=O)N(CC=C)C2CCN(C[C@H]3CN4OC5(C[C@H]4[C@@H]3c3ccccc3)CCCCC5)CC2)cc1