Reaction Details
TargetGlucagon receptor
LigandBDBM50122125
Substrate/Competitorn/a
Meas. Tech.ChEMBL_72875 (CHEMBL684126)
IC50 6.2±n/a nM
Citation Madsen, PLing, APlewe, MSams, CKKnudsen, LBSidelmann, UGYnddal, LBrand, CLAndersen, BMurphy, DTeng, MTruesdale, LKiel, DMay, JKuki, AShi, SJohnson, MDTeston, KAFeng, JLakis, JAnderes, KGregor, VLau, J Optimization of alkylidene hydrazide based human glucagon receptor antagonists. Discovery of the highly potent and orally available 3-cyano-4-hydroxybenzoic acid [1-(2,3,5,6-tetramethylbenzyl)-1H-indol-4-ylmethylene]hydrazide. J Med Chem45:5755-75 (2002) Glucagon receptor
Name:Glucagon receptor
Type:Enzyme
Mol. Mass.:54026.92
Organism:Homo sapiens (Human)
Description:P47871
Residue:477
BDBM50122125
NameBDBM50122125
Synonyms:CHEMBL421809 | N-Benzyl-2-{4-[(3-chloro-4-hydroxy-benzoyl)-hydrazonomethyl]-naphthalen-1-yl}-N-(2-dimethylamino-ethyl)-acetamide
TypeSmall organic molecule
Emp. Form.C31H31ClN4O3
Mol. Mass.543.056
SMILESCN(C)CCN(Cc1ccccc1)C(=O)Cc1ccc(\C=N\NC(=O)c2ccc(O)c(Cl)c2)c2ccccc12