Reaction Details
TargetGlucagon receptor
LigandBDBM50122153
Substrate/Competitorn/a
Meas. Tech.ChEMBL_72875 (CHEMBL684126)
IC50 3.4±n/a nM
Citation Madsen, PLing, APlewe, MSams, CKKnudsen, LBSidelmann, UGYnddal, LBrand, CLAndersen, BMurphy, DTeng, MTruesdale, LKiel, DMay, JKuki, AShi, SJohnson, MDTeston, KAFeng, JLakis, JAnderes, KGregor, VLau, J Optimization of alkylidene hydrazide based human glucagon receptor antagonists. Discovery of the highly potent and orally available 3-cyano-4-hydroxybenzoic acid [1-(2,3,5,6-tetramethylbenzyl)-1H-indol-4-ylmethylene]hydrazide. J Med Chem45:5755-75 (2002) Glucagon receptor
Name:Glucagon receptor
Type:Enzyme
Mol. Mass.:54026.92
Organism:Homo sapiens (Human)
Description:P47871
Residue:477
BDBM50122153
NameBDBM50122153
Synonyms:CHEMBL156724 | Cyclopentanecarboxylic acid {4-[(3-chloro-4-hydroxy-benzoyl)-hydrazonomethyl]-naphthalen-1-yl}-cyclopentanecarbonyl-amide
TypeSmall organic molecule
Emp. Form.C30H30ClN3O4
Mol. Mass.532.03
SMILESOc1ccc(cc1Cl)C(=O)NN=Cc1ccc(N(C(=O)C2CCCC2)C(=O)C2CCCC2)c2ccccc12