Reaction Details
TargetGag-Pol polyprotein [489-587]
LigandBDBM50127969
Substrate/Competitorn/a
Meas. Tech.ChEMBL_159455 (CHEMBL766800)
IC50 0.030000±n/a nM
Citation Lu, ZRaghavan, SBohn, JCharest, MStahlhut, MWRutkowski, CASimcoe, ALOlsen, DBSchleif, WACarella, AGabryelski, LJin, LLin, JHEmini, EChapman, KTata, JR Design and synthesis of highly potent HIV protease inhibitors with activity against resistant virus. Bioorg Med Chem Lett13:1821-4 (2003) Gag-Pol polyprotein [489-587]
Name:Gag-Pol polyprotein [489-587]
Type:Enzyme Subunit
Mol. Mass.:10781.16
Organism:Human immunodeficiency virus type 1
Description:P04585[489-587]
Residue:99
BDBM50127969
NameBDBM50127969
Synonyms:(R)-3-[(2R,4R)-2-Hydroxy-4-((3S,4S)-3-hydroxy-chroman-4-ylcarbamoyl)-5-phenyl-pentanoyl]-5,5-dimethyl-thiazolidine-4-carboxylic acid 2,6-dimethyl-benzylamide | CHEMBL52702
TypeSmall organic molecule
Emp. Form.C36H43N3O6S
Mol. Mass.645.808
SMILESCc1cccc(C)c1CNC(=O)[C@H]1N(CSC1(C)C)C(=O)[C@H](O)C[C@@H](Cc1ccccc1)C(=O)N[C@@H]1[C@H](O)COc2ccccc12