Reaction Details
TargetProto-oncogene tyrosine-protein kinase Src
LigandBDBM50132322
Substrate/Competitorn/a
Meas. Tech.ChEBML_202617
IC50 4±n/a nM
Citation Sundaramoorthi, RShakespeare, WCKeenan, TPMetcalf, CAWang, YMani, UTaylor, MLiu, SBohacek, RSNarula, SSDalgarno, DCvan Schravandijk, MRViolette, SMLiou, SAdams, SRam, MKKeats, JAWeigle, MSawyer, TKWeigele, M Bone-targeted Src kinase inhibitors: novel pyrrolo- and pyrazolopyrimidine analogues. Bioorg Med Chem Lett13:3063-6 (2003) Proto-oncogene tyrosine-protein kinase Src
Name:Proto-oncogene tyrosine-protein kinase Src
Type:Protein
Mol. Mass.:59838.60
Organism:Homo sapiens (Human)
Description:P12931
Residue:536
BDBM50132322
NameBDBM50132322
Synonyms:({2-[(2-{4-[4-Amino-5-(3-hydroxy-phenyl)-pyrrolo[2,3-d]pyrimidin-7-yl]-phenyl}-ethyl)-methyl-amino]-ethoxy}-hydroxy-phosphorylmethyl)-phosphonic acid | CHEMBL318996
TypeSmall organic molecule
Emp. Form.C24H29N5O7P2
Mol. Mass.561.4639
SMILESCN(CCOP(O)(=O)CP(O)(O)=O)CCc1ccc(cc1)-n1cc(-c2cccc(O)c2)c2c(N)ncnc12