Reaction Details
TargetProstaglandin G/H synthase 1
LigandBDBM50137420
Substrate/Competitorn/a
Meas. Tech.ChEBML_158583
IC50 50±n/a nM
Citation Li, JDeMello, KMCheng, HSakya, SMBronk, BSRafka, RJJaynes, BHZiegler, CBKilroy, CMann, DWNimz, ELLynch, MPHaven, MLKolosko, NLMinich, MLLi, CDutra, JKRast, BCrosson, RMMorton, BJKirk, GWCallaghan, KMKoss, DAShavnya, ALund, LASeibel, SBPetras, CFSilvia, A Discovery of a potent, selective and orally active canine COX-2 inhibitor, 2-(3-difluoromethyl-5-phenyl-pyrazol-1-yl)-5-methanesulfonyl-pyridine. Bioorg Med Chem Lett14:95-8 (2003) Prostaglandin G/H synthase 1
Name:Prostaglandin G/H synthase 1
Type:PROTEIN
Mol. Mass.:69314.28
Organism:Canis familiaris
Description:ChEMBL_327426
Residue:603
BDBM50137420
NameBDBM50137420
Synonyms:2-[5-(4-Ethoxy-phenyl)-3-trifluoromethyl-pyrazol-1-yl]-5-methanesulfonyl-pyridine | CHEMBL176265
TypeSmall organic molecule
Emp. Form.C18H16F3N3O3S
Mol. Mass.411.398
SMILESCCOc1ccc(cc1)-c1cc(nn1-c1ccc(cn1)S(C)(=O)=O)C(F)(F)F