Reaction Details
TargetHexokinase-4
LigandBDBM50161669
Substrate/Competitorn/a
Meas. Tech.ChEMBL_304261 (CHEMBL829031)
EC50 29100±n/a nM
Citation Castelhano, ALDong, HFyfe, MCGardner, LSKamikozawa, YKurabayashi, SNawano, MOhashi, RProcter, MJQiu, LRasamison, CMSchofield, KLShah, VKUeta, KWilliams, GMWitter, DYasuda, K Glucokinase-activating ureas. Bioorg Med Chem Lett15:1501-4 (2005) 
 
Hexokinase-4
Name:Hexokinase-4
Type:PROTEIN
Mol. Mass.:52101.81
Organism:Rattus norvegicus
Description:ChEMBL_1279785
Residue:465
BDBM50161669
NameBDBM50161669
Synonyms:1-Cyclopentylmethyl-1-(6-methoxy-pyridin-3-yl)-3-(4-oxo-4,5-dihydro-thiazol-2-yl)-urea | CHEMBL181713
TypeSmall organic molecule
Emp. Form.C16H20N4O3S
Mol. Mass.348.42
SMILESCOc1ccc(cn1)N(CC1CCCC1)C(=O)Nc1nc(O)cs1