Reaction Details
TargetHexokinase-4
LigandBDBM50161673
Substrate/Competitorn/a
Meas. Tech.ChEMBL_304261 (CHEMBL829031)
EC50 34200±n/a nM
Citation Castelhano, ALDong, HFyfe, MCGardner, LSKamikozawa, YKurabayashi, SNawano, MOhashi, RProcter, MJQiu, LRasamison, CMSchofield, KLShah, VKUeta, KWilliams, GMWitter, DYasuda, K Glucokinase-activating ureas. Bioorg Med Chem Lett15:1501-4 (2005) 
 
Hexokinase-4
Name:Hexokinase-4
Type:PROTEIN
Mol. Mass.:52101.81
Organism:Rattus norvegicus
Description:ChEMBL_1279785
Residue:465
BDBM50161673
NameBDBM50161673
Synonyms:1-Cyclopentylmethyl-1-(4-methanesulfonyl-phenyl)-3-(5-trifluoromethyl-[1,3,4]thiadiazol-2-yl)-urea | CHEMBL180605
TypeSmall organic molecule
Emp. Form.C17H19F3N4O3S2
Mol. Mass.448.483
SMILESCS(=O)(=O)c1ccc(cc1)N(CC1CCCC1)C(=O)Nc1nnc(s1)C(F)(F)F