Reaction Details
TargetHexokinase-4
LigandBDBM50161679
Substrate/Competitorn/a
Meas. Tech.ChEMBL_304261 (CHEMBL829031)
EC50 2400±n/a nM
Citation Castelhano, ALDong, HFyfe, MCGardner, LSKamikozawa, YKurabayashi, SNawano, MOhashi, RProcter, MJQiu, LRasamison, CMSchofield, KLShah, VKUeta, KWilliams, GMWitter, DYasuda, K Glucokinase-activating ureas. Bioorg Med Chem Lett15:1501-4 (2005) 
 
Hexokinase-4
Name:Hexokinase-4
Type:PROTEIN
Mol. Mass.:52101.81
Organism:Rattus norvegicus
Description:ChEMBL_1279785
Residue:465
BDBM50161679
NameBDBM50161679
Synonyms:3-(5-Chloro-thiazol-2-yl)-1-(4-cyano-phenyl)-1-cyclopentylmethyl-urea | CHEMBL361324
TypeSmall organic molecule
Emp. Form.C17H17ClN4OS
Mol. Mass.360.861
SMILESClc1cnc(NC(=O)N(CC2CCCC2)c2ccc(cc2)C#N)s1