Reaction Details
TargetHexokinase-4
LigandBDBM50161674
Substrate/Competitorn/a
Meas. Tech.ChEMBL_304261 (CHEMBL829031)
EC50 2200±n/a nM
Citation Castelhano, ALDong, HFyfe, MCGardner, LSKamikozawa, YKurabayashi, SNawano, MOhashi, RProcter, MJQiu, LRasamison, CMSchofield, KLShah, VKUeta, KWilliams, GMWitter, DYasuda, K Glucokinase-activating ureas. Bioorg Med Chem Lett15:1501-4 (2005) 
 
Hexokinase-4
Name:Hexokinase-4
Type:PROTEIN
Mol. Mass.:52101.81
Organism:Rattus norvegicus
Description:ChEMBL_1279785
Residue:465
BDBM50161674
NameBDBM50161674
Synonyms:3-Cyclopentyl-2-(4-methanesulfonyl-phenyl)-N-thiazol-2-yl-propionamide | CHEMBL359618
TypeSmall organic molecule
Emp. Form.C18H22N2O3S2
Mol. Mass.378.509
SMILESCS(=O)(=O)c1ccc(cc1)C(CC1CCCC1)C(=O)Nc1nccs1