Reaction Details
TargetHexokinase-4
LigandBDBM50161686
Substrate/Competitorn/a
Meas. Tech.ChEMBL_304261 (CHEMBL829031)
EC50 1300±n/a nM
Citation Castelhano, ALDong, HFyfe, MCGardner, LSKamikozawa, YKurabayashi, SNawano, MOhashi, RProcter, MJQiu, LRasamison, CMSchofield, KLShah, VKUeta, KWilliams, GMWitter, DYasuda, K Glucokinase-activating ureas. Bioorg Med Chem Lett15:1501-4 (2005) 
 
Hexokinase-4
Name:Hexokinase-4
Type:PROTEIN
Mol. Mass.:52101.81
Organism:Rattus norvegicus
Description:ChEMBL_1279785
Residue:465
BDBM50161686
NameBDBM50161686
Synonyms:3-(5-Chloro-thiazol-2-yl)-1-cyclopentylmethyl-1-(4-trifluoromethyl-phenyl)-urea | CHEMBL179038
TypeSmall organic molecule
Emp. Form.C17H17ClF3N3OS
Mol. Mass.403.85
SMILESFC(F)(F)c1ccc(cc1)N(CC1CCCC1)C(=O)Nc1ncc(Cl)s1