Reaction Details
TargetInsulin-like growth factor 1 receptor
LigandBDBM50201124
Substrate/Competitorn/a
Meas. Tech.ChEMBL_321273 (CHEMBL881279)
IC50 180±n/a nM
Citation Wittman, MCarboni, JAttar, RBalasubramanian, BBalimane, PBrassil, PBeaulieu, FChang, CClarke, WDell, JEummer, JFrennesson, DGottardis, MGreer, AHansel, SHurlburt, WJacobson, BKrishnananthan, SLee, FYLi, ALin, TALiu, POuellet, CSang, XSaulnier, MGStoffan, KSun, YVelaparthi, UWong, HYang, ZZimmermann, KZoeckler, MVyas, D Discovery of a (1H-benzoimidazol-2-yl)-1H-pyridin-2-one (BMS-536924) inhibitor of insulin-like growth factor I receptor kinase with in vivo antitumor activity. J Med Chem48:5639-43 (2005) 
 
Insulin-like growth factor 1 receptor
Name:Insulin-like growth factor 1 receptor
Type:Protein
Mol. Mass.:154776.79
Organism:Homo sapiens (Human)
Description:P08069
Residue:1367
BDBM50201124
NameBDBM50201124
Synonyms:3-(6-(1H-imidazol-1-yl)-4-methyl-1H-benzo[d]imidazol-2-yl)-4-(2-(3-chlorophenyl)-2-hydroxyethylamino)pyridin-2(1H)-one CHEMBL231306
TypeSmall organic molecule
Emp. Form.C24H21ClN6O2
Mol. Mass.460.916
SMILESCc1cc(cc2nc([nH]c12)-c1c(NCC(O)c2cccc(Cl)c2)cc[nH]c1=O)-n1ccnc1