Reaction Details
TargetPeroxisome proliferator-activated receptor alpha
LigandBDBM50176612
Substrate/Competitorn/a
Meas. Tech.ChEMBL_327488 (CHEMBL862360)
EC50 181±n/a nM
Citation Lowe, DBBifulco, NBullock, WHClaus, TCoish, PDai, MDela Cruz, FEDickson, DFan, DHoover-Litty, HLi, TMa, XMannelly, GMonahan, MKMuegge, IO'Connor, SRodriguez, MShelekhin, TStolle, ASweet, LWang, MWang, YZhang, CZhang, HJZhang, MZhao, KZhao, QZhu, JZhu, LTsutsumi, M Substituted indanylacetic acids as PPAR-alpha-gamma activators. Bioorg Med Chem Lett16:297-301 (2005) 
 
Peroxisome proliferator-activated receptor alpha
Name:Peroxisome proliferator-activated receptor alpha
Type:Enzyme
Mol. Mass.:52222.08
Organism:Homo sapiens (Human)
Description:Q07869
Residue:468
BDBM50176612
NameBDBM50176612
Synonyms:2-(6-bromo-5-(2-(5-methyl-2-phenyloxazol-4-yl)ethoxy)-2,3-dihydro-1H-inden-1-yl)butanoic acid | CHEMBL199530
TypeSmall organic molecule
Emp. Form.C25H26BrNO4
Mol. Mass.484.382
SMILESCCC(C1CCc2cc(OCCc3nc(oc3C)-c3ccccc3)c(Br)cc12)C(O)=O