Reaction Details
TargetC-C chemokine receptor type 8
LigandBDBM50185909
Substrate/Competitorn/a
Meas. Tech.ChEMBL_351818 (CHEMBL867801)
Ki 6±n/a nM
Citation Ghosh, SElder, AGuo, JMani, UPatane, MCarson, KYe, QBennett, RChi, SJenkins, TGuan, BKolbeck, RSmith, SZhang, CLaRosa, GJaffee, BYang, HEddy, PLu, CUttamsingh, VHorlick, RHarriman, GFlynn, D Design, synthesis, and progress toward optimization of potent small molecule antagonists of CC chemokine receptor 8 (CCR8). J Med Chem49:2669-72 (2006) 
 
C-C chemokine receptor type 8
Name:C-C chemokine receptor type 8
Type:PROTEIN
Mol. Mass.:40855.53
Organism:Homo sapiens (Human)
Description:ChEMBL_454278
Residue:355
BDBM50185909
NameBDBM50185909
Synonyms:2-(3-((1-(3-(2-chlorophenoxy)benzyl)piperidin-4-yl)carbamoyl)-3-phenylpyrrolidin-1-yl)-2-methylpropanoic acid | CHEMBL205993
TypeSmall organic molecule
Emp. Form.C33H38ClN3O4
Mol. Mass.576.126
SMILESCC(C)(N1CCC(C1)(C(=O)NC1CCN(Cc2cccc(Oc3ccccc3Cl)c2)CC1)c1ccccc1)C(O)=O