Reaction Details
TargetPotassium voltage-gated channel subfamily H member 2
LigandBDBM50205452
Substrate/Competitorn/a
Meas. Tech.ChEMBL_438371 (CHEMBL886338)
Ki 45000±n/a nM
Citation Murphy, STCase, HLEllsworth, EHagen, SHuband, MJoannides, TLimberakis, CMarotti, KROttolini, AMRauckhorst, MStarr, JStier, MTaylor, CZhu, TBlaser, ADenny, WALu, GLSmaill, JBRivault, F The synthesis and biological evaluation of novel series of nitrile-containing fluoroquinolones as antibacterial agents. Bioorg Med Chem Lett17:2150-5 (2007) 
 
Potassium voltage-gated channel subfamily H member 2
Name:Potassium voltage-gated channel subfamily H member 2
Type:Multi-pass membrane protein
Mol. Mass.:126672.65
Organism:Homo sapiens (Human)
Description:Q12809
Residue:1159
BDBM50205452
NameBDBM50205452
Synonyms:7-(3-(aminomethyl)-3-ethylazetidin-1-yl)-1-cyclopropyl-6-fluoro-8-methyl-4-oxo-1,4-dihydroquinoline-3-carboxylic acid | CHEMBL388488
TypeSmall organic molecule
Emp. Form.C20H24FN3O3
Mol. Mass.373.4213
SMILESCCC1(CN)CN(C1)c1c(F)cc2c(c1C)n(cc(C(O)=O)c2=O)C1CC1