Reaction Details
TargetSqualene synthase
LigandBDBM50291313
Substrate/Competitorn/a
Meas. Tech.ChEBML_202267
Ki>250±n/a nM
Citation Brown, GRFoubister, AJFreeman, SMcTaggart, FMirrlees, DJReid, ACSmith, GJTaylor, MJThomason, DAWhittamore, PR Novel optimised quinuclidine squalene synthase inhibitors Bioorg Med Chem Lett7:597-600 (1997)    Article
 
Squalene synthase
Name:Squalene synthase
Type:PROTEIN
Mol. Mass.:48109.41
Organism:Rattus norvegicus
Description:ChEMBL_1336736
Residue:416
BDBM50291313
NameBDBM50291313
Synonyms:3-[3-Allyl-4-(3-hydroxy-1-aza-bicyclo[2.2.2]oct-3-ylethynyl)-phenyl]-N,N-diethyl-propionamide | CHEMBL158303
TypeSmall organic molecule
Emp. Form.C25H34N2O2
Mol. Mass.394.5497
SMILESCCN(CC)C(=O)CCc1ccc(C#CC2(O)CN3CCC2CC3)c(CC=C)c1