Reaction Details
TargetGenome polyprotein
LigandBDBM50301902
Substrate/Competitorn/a
Meas. Tech.ChEMBL_598467 (CHEMBL1039991)
IC50 3±n/a nM
Citation de Vicente, JHendricks, RTSmith, DBFell, JBFischer, JSpencer, SRStengel, PJMohr, PRobinson, JEBlake, JFHilgenkamp, RKYee, CZhao, JElworthy, TRTracy, JChin, ELi, JLui, AWang, BOshiro, CHarris, SFGhate, MLeveque, VJNajera, ILe Pogam, SRajyaguru, SAo-Ieong, GAlexandrova, LFitch, BBrandl, MMasjedizadeh, MWu, SYde Keczer, SVoronin, T Non-nucleoside inhibitors of HCV polymerase NS5B. Part 3: synthesis and optimization studies of benzothiazine-substituted tetramic acids. Bioorg Med Chem Lett19:5648-51 (2009) 
 
Genome polyprotein
Name:Genome polyprotein
Type:Enzyme
Mol. Mass.:326966.11
Organism:Hepatitis C virus (HCV)
Description:Q9WMX2
Residue:3010
BDBM50301902
NameBDBM50301902
Synonyms:CHEMBL571825 | N-{3-[(S)-5-tert-Butyl-1-(4-fluoro-3-methyl-benzyl)-4-hydroxy-2-oxo-2,5-dihydro-1H-pyrrol-3-yl]-1,1-dioxo-1,4-dihydro-1lambda*6*-benzo[1,4]thiazin-7-yl}-methanesulfonamide
TypeSmall organic molecule
Emp. Form.C25H28FN3O6S2
Mol. Mass.549.635
SMILESCc1cc(CN2[C@H](C(=O)C(C2=O)C2=Nc3ccc(NS(C)(=O)=O)cc3S(=O)(=O)C2)C(C)(C)C)ccc1F