Reaction Details
TargetC-C chemokine receptor type 5
LigandBDBM50310727
Substrate/Competitorn/a
Meas. Tech.ChEMBL_621115 (CHEMBL1113199)
IC50 24±n/a nM
Citation Rotstein, DMGabriel, SDMakra, FFilonova, LGleason, SBrotherton-Pleiss, CSetti, LQTrejo-Martin, ALee, EKSankuratri, SJi, CDerosier, ADioszegi, MHeilek, GJekle, ABerry, PWeller, PMau, CI Spiropiperidine CCR5 antagonists. Bioorg Med Chem Lett19:5401-6 (2009) 
 
C-C chemokine receptor type 5
Name:C-C chemokine receptor type 5
Type:Enzyme
Mol. Mass.:40540.21
Organism:Homo sapiens (Human)
Description:P51681
Residue:352
BDBM50310727
NameBDBM50310727
Synonyms:4-butyl-8-(1-(2,6-dimethylbenzoyl)piperidin-4-yl)-3-((tetrahydro-2H-pyran-4-yl)methyl)-1-oxa-3,8-diazaspiro[4.5]decan-2-one | CHEMBL1078072
TypeSmall organic molecule
Emp. Form.C31H47N3O4
Mol. Mass.525.7226
SMILESCCCCC1N(CC2CCOCC2)C(=O)OC11CCN(CC1)C1CCN(CC1)C(=O)c1c(C)cccc1C