Reaction Details
TargetC-C chemokine receptor type 5
LigandBDBM50310733
Substrate/Competitorn/a
Meas. Tech.ChEMBL_621115 (CHEMBL1113199)
IC50 30±n/a nM
Citation Rotstein, DMGabriel, SDMakra, FFilonova, LGleason, SBrotherton-Pleiss, CSetti, LQTrejo-Martin, ALee, EKSankuratri, SJi, CDerosier, ADioszegi, MHeilek, GJekle, ABerry, PWeller, PMau, CI Spiropiperidine CCR5 antagonists. Bioorg Med Chem Lett19:5401-6 (2009) 
 
C-C chemokine receptor type 5
Name:C-C chemokine receptor type 5
Type:Enzyme
Mol. Mass.:40540.21
Organism:Homo sapiens (Human)
Description:P51681
Residue:352
BDBM50310733
NameBDBM50310733
Synonyms:5-butyl-3-(cyclohexylmethyl)-9-(1-(2,6-dimethylbenzoyl)piperidin-4-yl)-1-oxa-3,9-diazaspiro[5.5]undecan-2-one | CHEMBL1078753
TypeSmall organic molecule
Emp. Form.C33H51N3O3
Mol. Mass.537.7763
SMILESCCCCC1CN(CC2CCCCC2)C(=O)OC11CCN(CC1)C1CCN(CC1)C(=O)c1c(C)cccc1C