Reaction Details
TargetPhosphatidylinositol 4,5-bisphosphate 3-kinase catalytic subunit alpha isoform
LigandBDBM50312613
Substrate/Competitorn/a
Meas. Tech.ChEMBL_615563 (CHEMBL1108625)
IC50 3.4±n/a nM
Citation Sutherlin, DPSampath, DBerry, MCastanedo, GChang, ZChuckowree, IDotson, JFolkes, AFriedman, LGoldsmith, RHeffron, TLee, LLesnick, JLewis, CMathieu, SNonomiya, JOlivero, APang, JPrior, WWSalphati, LSideris, STian, QTsui, VWan, NCWang, SWiesmann, CWong, SZhu, BY Discovery of (thienopyrimidin-2-yl)aminopyrimidines as potent, selective, and orally available pan-PI3-kinase and dual pan-PI3-kinase/mTOR inhibitors for the treatment of cancer. J Med Chem53:1086-97 (2010) 
 
Phosphatidylinositol 4,5-bisphosphate 3-kinase catalytic subunit alpha isoform
Name:Phosphatidylinositol 4,5-bisphosphate 3-kinase catalytic subunit alpha isoform
Type:Enzyme Subunit
Mol. Mass.:124294.87
Organism:Homo sapiens (Human)
Description:P42336
Residue:1068
BDBM50312613
NameBDBM50312613
Synonyms:2-(2-(2-Aminopyrimidin-5-yl)-4-morpholinothieno[3,2-d]pyrimidin-6-yl)propan-2-ol | CHEMBL1084926
TypeSmall organic molecule
Emp. Form.C17H20N6O2S
Mol. Mass.372.445
SMILESCC(C)(O)c1cc2nc(nc(N3CCOCC3)c2s1)-c1cnc(N)nc1