Reaction Details
TargetSerine/threonine-protein kinase mTOR
LigandBDBM50315911
Substrate/Competitorn/a
Meas. Tech.ChEMBL_625039 (CHEMBL1109707)
Ki 5±n/a nM
Citation Heffron, TPBerry, MCastanedo, GChang, CChuckowree, IDotson, JFolkes, AGunzner, JLesnick, JDLewis, CMathieu, SNonomiya, JOlivero, APang, JPeterson, DSalphati, LSampath, DSideris, SSutherlin, DPTsui, VWan, NCWang, SWong, SZhu, BY Identification of GNE-477, a potent and efficacious dual PI3K/mTOR inhibitor. Bioorg Med Chem Lett20:2408-11 (2010) 
 
Serine/threonine-protein kinase mTOR
Name:Serine/threonine-protein kinase mTOR
Type:Rapamycin target protein
Mol. Mass.:288917.12
Organism:Homo sapiens (Human)
Description:P42345
Residue:2549
BDBM50315911
NameBDBM50315911
Synonyms:5-(6-(3-(methylsulfonyl)phenyl)-4-morpholinothieno[3,2-d]pyrimidin-2-yl)pyrimidin-2-amine | CHEMBL1090601
TypeSmall organic molecule
Emp. Form.C21H20N6O3S2
Mol. Mass.468.552
SMILESCS(=O)(=O)c1cccc(c1)-c1cc2nc(nc(N3CCOCC3)c2s1)-c1cnc(N)nc1