Reaction Details
TargetAurora kinase A
LigandBDBM50322807
Substrate/Competitorn/a
Meas. Tech.ChEMBL_642509 (CHEMBL1175882)
IC50 640±n/a nM
Citation Coumar, MSChu, CYLin, CWShiao, HYHo, YLReddy, RLin, WHChen, CHPeng, YHLeou, JSLien, TWHuang, CTFang, MYWu, SHWu, JSChittimalla, SKSong, JSHsu, JTWu, SYLiao, CCChao, YSHsieh, HP Fast-forwarding hit to lead: aurora and epidermal growth factor receptor kinase inhibitor lead identification. J Med Chem53:4980-8 (2010) 
 
Aurora kinase A
Name:Aurora kinase A
Type:Serine/threonine-protein kinase
Mol. Mass.:45830.98
Organism:Homo sapiens (Human)
Description:O14965
Residue:403
BDBM50322807
NameBDBM50322807
Synonyms:CHEMBL1173151 | [2-(4-Aminophenyl)ethyl]-(5,6-diphenylfuro[2,3-d]pyrimidin-4-yl)-amine
TypeSmall organic molecule
Emp. Form.C26H22N4O
Mol. Mass.406.4791
SMILESNc1ccc(CCNc2ncnc3oc(c(-c4ccccc4)c23)-c2ccccc2)cc1