Reaction Details
TargetAurora kinase A
LigandBDBM50322814
Substrate/Competitorn/a
Meas. Tech.ChEMBL_642509 (CHEMBL1175882)
IC50 973±n/a nM
Citation Coumar, MSChu, CYLin, CWShiao, HYHo, YLReddy, RLin, WHChen, CHPeng, YHLeou, JSLien, TWHuang, CTFang, MYWu, SHWu, JSChittimalla, SKSong, JSHsu, JTWu, SYLiao, CCChao, YSHsieh, HP Fast-forwarding hit to lead: aurora and epidermal growth factor receptor kinase inhibitor lead identification. J Med Chem53:4980-8 (2010) 
 
Aurora kinase A
Name:Aurora kinase A
Type:Serine/threonine-protein kinase
Mol. Mass.:45830.98
Organism:Homo sapiens (Human)
Description:O14965
Residue:403
BDBM50322814
NameBDBM50322814
Synonyms:1-(5,6-Diphenylfuro[2,3-d]pyrimidin-4-ylamino)propan-2-ol | CHEMBL1172716
TypeSmall organic molecule
Emp. Form.C21H19N3O2
Mol. Mass.345.3945
SMILESC[C@@H](O)CNc1ncnc2oc(c(-c3ccccc3)c12)-c1ccccc1