Reaction Details
TargetAurora kinase A
LigandBDBM50322819
Substrate/Competitorn/a
Meas. Tech.ChEMBL_642509 (CHEMBL1175882)
IC50>10000±n/a nM
Citation Coumar, MSChu, CYLin, CWShiao, HYHo, YLReddy, RLin, WHChen, CHPeng, YHLeou, JSLien, TWHuang, CTFang, MYWu, SHWu, JSChittimalla, SKSong, JSHsu, JTWu, SYLiao, CCChao, YSHsieh, HP Fast-forwarding hit to lead: aurora and epidermal growth factor receptor kinase inhibitor lead identification. J Med Chem53:4980-8 (2010) 
 
Aurora kinase A
Name:Aurora kinase A
Type:Serine/threonine-protein kinase
Mol. Mass.:45830.98
Organism:Homo sapiens (Human)
Description:O14965
Residue:403
BDBM50322819
NameBDBM50322819
Synonyms:3-(5,6-diphenylfuro[2,3-d]pyrimidin-4-ylamino)-N-phenylpropanamide | CHEMBL1173178
TypeSmall organic molecule
Emp. Form.C27H22N4O2
Mol. Mass.434.4892
SMILESO=C(CCNc1ncnc2oc(c(-c3ccccc3)c12)-c1ccccc1)Nc1ccccc1